Target
Activated CDC42 kinase 1
Ligand
BDBM419781
Substrate
Meas. Tech.
Inhibition Assay
IC50
1.38±n/a nM
Citation
 Lee, HChun, KJoe, BKim, ESJang, ESOh, HKim, JPark, JLee, H Tricyclic derivative compound, method for preparing same, and pharmaceutical composition comprising same US Patent  US10464919 Publication Date 11/5/2019 
Target
Name:
Activated CDC42 kinase 1
Synonyms:
ACK1 Activated CDC42 kinase 1 (ACK-1) Tyrosine kinase non-receptor protein 2
Type:
Protein
Mol. Mass.:
114577.86
Organism:
Homo sapiens (Human)
Description:
Q07912
Residue:
1038
  
Inhibitor
Name:
BDBM419781
Synonyms:
US10464919, Example 119
Type:
Small organic molecule
Emp. Form.:
C23H24FN5O3
Mol. Mass.:
437.4668
SMILES:
[O-][N+](=O)c1ccc(cc1F)N1CCN(Cc2ccc3c4NCCCc4c(=O)[nH]c3c2)CC1
: