Target
Activated CDC42 kinase 1
Ligand
BDBM419786
Substrate
Meas. Tech.
Inhibition Assay
IC50
4.71±n/a nM
Citation
 Lee, HChun, KJoe, BKim, ESJang, ESOh, HKim, JPark, JLee, H Tricyclic derivative compound, method for preparing same, and pharmaceutical composition comprising same US Patent  US10464919 Publication Date 11/5/2019 
Target
Name:
Activated CDC42 kinase 1
Synonyms:
ACK1 Activated CDC42 kinase 1 (ACK-1) Tyrosine kinase non-receptor protein 2
Type:
Protein
Mol. Mass.:
114577.86
Organism:
Homo sapiens (Human)
Description:
Q07912
Residue:
1038
  
Inhibitor
Name:
BDBM419786
Synonyms:
US10464919, Example 124
Type:
Small organic molecule
Emp. Form.:
C23H24N6O
Mol. Mass.:
400.4763
SMILES:
O=c1[nH]c2cc(CN3CCN(CC3)c3cc(ccn3)C#N)ccc2c2NCCCc12
: