Target
P2X purinoceptor 7
Ligand
BDBM254369
Substrate
Meas. Tech.
Radioligand Binding
Ki
5.80±n/a nM
Citation
 Alcazar Vaca, MJAllison, BDAndres Gil, JIChrovian, CCCoate, HRDe Angelis, MDeng, XDvorak, CAGelin, CFLetavic, MALiang, JTMani, NSRech, JCSavall, BMSoyode-Johnson, AStenne, BMSwanson, DMWall, JL P2X7 modulators and methods of use US Patent  US10112937 Publication Date 10/30/2018 
Target
Name:
P2X purinoceptor 7
Synonyms:
ATP receptor P2RX7_HUMAN P2X purinoceptor 7 (P2X7) P2Z receptor | Purinergic receptor
Type:
Protein
Mol. Mass.:
68602.85
Organism:
Homo sapiens (Human)
Description:
Q99572
Residue:
595
  
Inhibitor
Name:
BDBM254369
Synonyms:
US10112937, Example 276 US10703749, Example 276 | US9464084, 276
Type:
Small organic molecule
Emp. Form.:
C18H15F3N6O
Mol. Mass.:
388.3465
SMILES:
Cc1c(cccc1C(F)(F)F)C(=O)N1CCc2c(C1)nnn2-c1cnccn1
: