Target
P2X purinoceptor 7
Ligand
BDBM254402
Substrate
Meas. Tech.
Radioligand Binding
Ki
5.00±n/a nM
Citation
 Alcazar Vaca, MJAllison, BDAndres Gil, JIChrovian, CCCoate, HRDe Angelis, MDeng, XDvorak, CAGelin, CFLetavic, MALiang, JTMani, NSRech, JCSavall, BMSoyode-Johnson, AStenne, BMSwanson, DMWall, JL P2X7 modulators and methods of use US Patent  US10112937 Publication Date 10/30/2018 
Target
Name:
P2X purinoceptor 7
Synonyms:
ATP receptor P2RX7_HUMAN P2X purinoceptor 7 (P2X7) P2Z receptor | Purinergic receptor
Type:
Protein
Mol. Mass.:
68602.85
Organism:
Homo sapiens (Human)
Description:
Q99572
Residue:
595
  
Inhibitor
Name:
BDBM254402
Synonyms:
US10112937, Example 310 US10703749, Example 310 | US9464084, 310
Type:
Small organic molecule
Emp. Form.:
C18H16ClF3N6O
Mol. Mass.:
424.807
SMILES:
C[C@H]1Cc2c(nnn2-c2ccn[nH]2)[C@@H](C)N1C(=O)c1cccc(c1Cl)C(F)(F)F
: