Target
Cyclin-dependent kinase 4
Ligand
BDBM419868
Substrate
Meas. Tech.
Caliper Mobility Shift Assay
IC50
<20±n/a nM
Citation
 Zheng, YJin, HZhou, FHuang, MMeng, X 2,4-disubstituted pyrimidines as CDK inhibitors US Patent  US10464927 Publication Date 11/5/2019 
Target
Name:
Cyclin-dependent kinase 4
Synonyms:
CDK4 Cell division protein kinase 4 PSK-J3
Type:
Enzyme Subunit
Mol. Mass.:
33731.96
Organism:
Homo sapiens (Human)
Description:
P11802
Residue:
303
  
Inhibitor
Name:
BDBM419868
Synonyms:
US10464927, Compound I-16
Type:
Small organic molecule
Emp. Form.:
C28H32F3N7
Mol. Mass.:
523.5958
SMILES:
CC(C)N1CCN(Cc2ccc(Nc3nccc(n3)-c3ccc4n(C)c(C)c(c4c3)C(F)(F)F)nc2)CC1
: