Target
Bromodomain-containing protein 4 [342-460]
Ligand
BDBM318589
Substrate
Meas. Tech.
AlphaScreen Assay A2
IC50
<100±n/a nM
Citation
 Combs, APSparks, RBMaduskuie, Jr., TPRodgers, JD Tricyclic heterocycles as BET protein inhibitors US Patent  US10464947 Publication Date 11/5/2019 
Target
Name:
Bromodomain-containing protein 4 [342-460]
Synonyms:
BRD4 BRD4_HUMAN Bromodomain-containing protein 4 (BRD4)(BD2) | HUNK1
Type:
Enzyme Catalytic Domain
Mol. Mass.:
13783.81
Organism:
Homo sapiens (Human)
Description:
a.a. 342-460 (BRD4-BD2)
Residue:
119
  
Inhibitor
Name:
BDBM318589
Synonyms:
Single enantiomer of 3-[7-(3,5-dimethylisoxazol-4-yl)-2-oxo-1,2,4,5-tetrahydroimidazo[1,5,4-de][1,4]benzoxazin-4-yl]-N-ethylpyridine-2-carboxamide US11498926, Example 133 | US9624241, Example 133
Type:
Small organic molecule
Emp. Form.:
C22H21N5O4
Mol. Mass.:
419.4332
SMILES:
CCNC(=O)c1ncccc1C1COc2c(ccc3[nH]c(=O)n1c23)-c1c(C)noc1C
: