Target
Bromodomain-containing protein 4 [42-168]
Ligand
BDBM318649
Substrate
Meas. Tech.
AlphaScreen Assay A2
IC50
<100±n/a nM
Citation
 Combs, APSparks, RBMaduskuie, Jr., TPRodgers, JD Tricyclic heterocycles as BET protein inhibitors US Patent  US10464947 Publication Date 11/5/2019 
Target
Name:
Bromodomain-containing protein 4 [42-168]
Synonyms:
BRD4 BRD4_HUMAN HUNK1
Type:
Enzyme Catalytic Domain
Mol. Mass.:
15054.68
Organism:
Homo sapiens (Human)
Description:
O60885[42-168]
Residue:
127
  
Inhibitor
Name:
BDBM318649
Synonyms:
(3S)-1-[(4S)-7-(3,5-dimethylisoxazol-4- yl)-4-pyridin-2-yl-4,5- dihydroimidazo[1,5,4- de][1,4]benzoxazin-2-yl]-N,N- dimethylpyrrolidin-3-amine US11498926, Example 180B | US9624241, Example 180B
Type:
Small organic molecule
Emp. Form.:
C25H28N6O2
Mol. Mass.:
444.5288
SMILES:
CN(C)[C@H]1CCN(C1)c1nc2ccc(-c3c(C)noc3C)c3OC[C@H](c4ccccn4)n1c23
: