Target
Bromodomain-containing protein 4 [342-460]
Ligand
BDBM420103
Substrate
Meas. Tech.
AlphaScreen Assay A2
IC50
<100±n/a nM
Citation
 Combs, APSparks, RBMaduskuie, Jr., TPRodgers, JD Tricyclic heterocycles as BET protein inhibitors US Patent  US10464947 Publication Date 11/5/2019 
Target
Name:
Bromodomain-containing protein 4 [342-460]
Synonyms:
BRD4 BRD4_HUMAN Bromodomain-containing protein 4 (BRD4)(BD2) | HUNK1
Type:
Enzyme Catalytic Domain
Mol. Mass.:
13783.81
Organism:
Homo sapiens (Human)
Description:
a.a. 342-460 (BRD4-BD2)
Residue:
119
  
Inhibitor
Name:
BDBM420103
Synonyms:
N-{(3R)-1-[(4S)-7-(3,5- dimethylisoxazol-4-yl)-4-pyridin-2-yl- 4,5-dihydroimidazo[1,5,4- de][1,4]benzoxazin-2-yl]pyrrolidin-3- yl}cyclobutanecarboxamide | US10464947, Example 210
Type:
Small organic molecule
Emp. Form.:
C27H28N6O3
Mol. Mass.:
484.5496
SMILES:
Cc1oncc1-c1ccc2nc(N3CC[C@H](C3)NC(=O)C3CCC3)n3[C@H](COc1c23)c1ccccn1
: