Target
Bromodomain-containing protein 4 [42-168]
Ligand
BDBM318712
Substrate
Meas. Tech.
AlphaScreen Assay A2
IC50
<100±n/a nM
Citation
 Combs, APSparks, RBMaduskuie, Jr., TPRodgers, JD Tricyclic heterocycles as BET protein inhibitors US Patent  US10464947 Publication Date 11/5/2019 
Target
Name:
Bromodomain-containing protein 4 [42-168]
Synonyms:
BRD4 BRD4_HUMAN HUNK1
Type:
Enzyme Catalytic Domain
Mol. Mass.:
15054.68
Organism:
Homo sapiens (Human)
Description:
O60885[42-168]
Residue:
127
  
Inhibitor
Name:
BDBM318712
Synonyms:
N-{1-[(4S)-7-(3,5-dimethylisoxazol-4- yl)-4-pyridin-2-yl-4,5- dihydroimidazo[1,5,4- de][1,4]benzoxazin-2-yl]piperidin-4-yl}- 2,2,2-trifluoroacetamide US9624241, Example 242
Type:
Small organic molecule
Emp. Form.:
C26H25F3N6O3
Mol. Mass.:
526.5103
SMILES:
Cc1noc(C)c1-c1ccc2nc(N3CCC(CC3)NC(=O)C(F)(F)F)n3[C@H](COc1c23)c1ccccn1
: