Target
Bromodomain-containing protein 4 [368-440]
Ligand
BDBM391584
Substrate
Meas. Tech.
AlphaScreen Assay
IC50
<100±n/a nM
Citation
 Combs, APMaduskuie, Jr., TPFalahatpisheh, N 1H-pyrrolo[2,3-c]pyridin-7(6H)-ones and pyrazolo[3,4-c]pyridin-7(6H)-ones as inhibitors of BET proteins US Patent  US10472358 Publication Date 11/12/2019 
Target
Name:
Bromodomain-containing protein 4 [368-440]
Synonyms:
BRD4-BD2
Type:
Protein
Mol. Mass.:
Description:
Components:
This complex has 2 components.
Component 1
Name:
Bromodomain-containing protein 4
Synonyms:
BRD4 Bromodomain-containing protein 4 (BRD4) Protein HUNK1
Type:
Protein
Mol. Mass.:
152264.84
Organism:
Homo sapiens (Human)
Description:
O60885
Residue:
1362
  
Component 2
Name:
Bromodomain-containing protein 4 [368-440]
Synonyms:
BRD4 Bromo domain 2 Bromodomain-containing protein 4 (BRD4) Bromo 2 Bromodomain-containing protein 4 (BRD4)(Bromo 2) Bromodomain-containing protein 4 Bromodomain 2 (BRD4-2) HUNK1
Type:
Protein
Mol. Mass.:
8564.63
Organism:
Homo sapiens (Human)
Description:
BD2 (368-440 aa) of O60885
Residue:
73
  
Inhibitor
Name:
BDBM391584
Synonyms:
2,2-dimethyl-8-(6-methyl-7- oxo-6,7-dihydro-1H- pyrrolo[2,3-c]pyridin-4-yl)-6- (piperidin-1-ylsulfonyl)-2H- 1,4-benzoxazin-3(4H)-one US11059821, Example 73 US9957268, Example 72 | US9957268, Example 73
Type:
Small organic molecule
Emp. Form.:
C24H28N4O5S
Mol. Mass.:
484.568
SMILES:
CN1C(=O)C(C)(C)Oc2c1cc(cc2-c1cn(C)c(=O)c2[nH]ccc12)S(=O)(=O)N1CCCCC1
: