Target
Bromodomain-containing protein 4 [75-147]
Ligand
BDBM391595
Substrate
Meas. Tech.
AlphaScreen Assay
IC50
<100±n/a nM
Citation
 Combs, APMaduskuie, Jr., TPFalahatpisheh, N 1H-pyrrolo[2,3-c]pyridin-7(6H)-ones and pyrazolo[3,4-c]pyridin-7(6H)-ones as inhibitors of BET proteins US Patent  US10472358 Publication Date 11/12/2019 
Target
Name:
Bromodomain-containing protein 4 [75-147]
Synonyms:
BRD4-BD1
Type:
Protein
Mol. Mass.:
Description:
Components:
This complex has 2 components.
Component 1
Name:
Bromodomain-containing protein 4
Synonyms:
BRD4 Bromodomain-containing protein 4 (BRD4) Protein HUNK1
Type:
Protein
Mol. Mass.:
152264.84
Organism:
Homo sapiens (Human)
Description:
O60885
Residue:
1362
  
Component 2
Name:
Bromodomain-containing protein 4 [75-147]
Synonyms:
BRD4 Bromo domain 1 Bromodomain-containing protein 4 (BRD4) Bromo 1 Bromodomain-containing protein 4 (BRD4)(Bromo 1) Bromodomain-containing protein 4 Bromodomain 1 (BRD4-1) HUNK1
Type:
Mol. Mass.:
8856.55
Organism:
Homo sapiens (Human)
Description:
BD1 (75-147 aa) of O60885
Residue:
73
  
Inhibitor
Name:
BDBM391595
Synonyms:
6-(1-hydroxyethyl)-2,2,4- trimethyl-8-(6-methyl-7-oxo- 6,7-dihydro-1H-pyrrolo[2,3- c]pyridin-4-yl)-2H-1,4- benzoxazin-3(4H)-one US10781209, Example 83 US11702416, Example 83 | US9957268, Example 83
Type:
Small organic molecule
Emp. Form.:
C21H23N3O4
Mol. Mass.:
381.425
SMILES:
CC(O)c1cc2N(C)C(=O)C(C)(C)Oc2c(c1)-c1cn(C)c(=O)c2[nH]ccc12
: