Target
5'-nucleotidase
Ligand
BDBM419923
Substrate
Meas. Tech.
In Vitro Enzyme Assay
IC50
>50000±n/a nM
Citation
 Chen, LLi, JSjogren, EBBilledeau, RJ Ectonucleotidase inhibitors and methods of use thereof US Patent  US10472364 Publication Date 11/12/2019 
Target
Name:
5'-nucleotidase
Synonyms:
5'-NT 5NTD_HUMAN Ecto-5'-nucleotidase NT5 NTE
Type:
Enzyme
Mol. Mass.:
63371.54
Organism:
Homo sapiens (Human)
Description:
P21589
Residue:
574
  
Inhibitor
Name:
BDBM419923
Synonyms:
US10472364, Compound 9 | US11208414, Cpd. # 9
Type:
Small organic molecule
Emp. Form.:
C13H14FN5O7
Mol. Mass.:
371.278
SMILES:
Nc1ncnc2n(cnc12)[C@@H]1O[C@H](COC(C(O)=O)C(O)=O)[C@@H](O)[C@H]1F
: