Target
5'-nucleotidase
Ligand
BDBM419947
Substrate
Meas. Tech.
In Vitro Enzyme Assay
IC50
1510±n/a nM
Citation
 Chen, LLi, JSjogren, EBBilledeau, RJ Ectonucleotidase inhibitors and methods of use thereof US Patent  US10472364 Publication Date 11/12/2019 
Target
Name:
5'-nucleotidase
Synonyms:
5'-NT 5NTD_HUMAN Ecto-5'-nucleotidase NT5 NTE
Type:
Enzyme
Mol. Mass.:
63371.54
Organism:
Homo sapiens (Human)
Description:
P21589
Residue:
574
  
Inhibitor
Name:
BDBM419947
Synonyms:
US10472364, Compound 33 | US11208414, Cpd. # 33
Type:
Small organic molecule
Emp. Form.:
C15H14ClFN6O7
Mol. Mass.:
444.759
SMILES:
Nc1nc(Cl)nc2n(cnc12)[C@@H]1O[C@H](COC(CC#N)(C(O)=O)C(O)=O)[C@@H](O)[C@@H]1F
: