Target
5'-nucleotidase
Ligand
BDBM419964
Substrate
Meas. Tech.
In Vitro Enzyme Assay
IC50
839±n/a nM
Citation
 Chen, LLi, JSjogren, EBBilledeau, RJ Ectonucleotidase inhibitors and methods of use thereof US Patent  US10472364 Publication Date 11/12/2019 
Target
Name:
5'-nucleotidase
Synonyms:
5'-NT 5NTD_HUMAN Ecto-5'-nucleotidase NT5 NTE
Type:
Enzyme
Mol. Mass.:
63371.54
Organism:
Homo sapiens (Human)
Description:
P21589
Residue:
574
  
Inhibitor
Name:
BDBM419964
Synonyms:
US10472364, Compound 49 US11034715, Cpd. # 49 | US11208414, Cpd. # 49
Type:
Small organic molecule
Emp. Form.:
C21H21ClFN5O8
Mol. Mass.:
525.872
SMILES:
COc1cccc(CC(OC[C@H]2O[C@H]([C@@H](F)[C@@H]2O)n2cnc3c(N)nc(Cl)nc23)(C(O)=O)C(O)=O)c1
: