Target
5'-nucleotidase
Ligand
BDBM420014
Substrate
Meas. Tech.
In Vitro Enzyme Assay
IC50
8264±n/a nM
Citation
 Chen, LLi, JSjogren, EBBilledeau, RJ Ectonucleotidase inhibitors and methods of use thereof US Patent  US10472364 Publication Date 11/12/2019 
Target
Name:
5'-nucleotidase
Synonyms:
5'-NT 5NTD_HUMAN Ecto-5'-nucleotidase NT5 NTE
Type:
Enzyme
Mol. Mass.:
63371.54
Organism:
Homo sapiens (Human)
Description:
P21589
Residue:
574
  
Inhibitor
Name:
BDBM420014
Synonyms:
US10472364, Compound 84 US11034715, Cpd. # 84 | US11208414, Cpd. # 84
Type:
Small organic molecule
Emp. Form.:
C28H27ClFN5O7
Mol. Mass.:
599.995
SMILES:
CCOC(=O)C(Cc1ccc(cc1)-c1ccccc1)(OC[C@H]1O[C@H]([C@@H](F)[C@@H]1O)n1cnc2c(N)nc(Cl)nc12)C(O)=O
: