Target
5'-nucleotidase
Ligand
BDBM420017
Substrate
Meas. Tech.
In Vitro Enzyme Assay
IC50
83.0±n/a nM
Citation
 Chen, LLi, JSjogren, EBBilledeau, RJ Ectonucleotidase inhibitors and methods of use thereof US Patent  US10472364 Publication Date 11/12/2019 
Target
Name:
5'-nucleotidase
Synonyms:
5'-NT 5NTD_HUMAN Ecto-5'-nucleotidase NT5 NTE
Type:
Enzyme
Mol. Mass.:
63371.54
Organism:
Homo sapiens (Human)
Description:
P21589
Residue:
574
  
Inhibitor
Name:
BDBM420017
Synonyms:
US10472364, Compound 87 US11034715, Cpd. # 87 | US11208414, Cpd. # 87
Type:
Small organic molecule
Emp. Form.:
C24H24ClFN6O10
Mol. Mass.:
610.933
SMILES:
Nc1nc(Cl)nc2n(cnc12)[C@@H]1O[C@H](COC(Cc2ccc(cc2)C(=O)NCCC(O)=O)(C(O)=O)C(O)=O)[C@@H](O)[C@@H]1F
: