Target
Tyrosine-protein kinase JAK3
Ligand
BDBM279813
Substrate
Meas. Tech.
Biochemical JAK and Off-Target Kinase Assays
Ki
66±n/a nM
Citation
 Huang, X Pyrimidine compounds as JAK kinase inhibitors US Patent  US10485803 Publication Date 11/26/2019 
Target
Name:
Tyrosine-protein kinase JAK3
Synonyms:
JAK-3 JAK3_HUMAN Janus kinase 3 (JAK3) L-JAK | Leukocyte janus kinase
Type:
Protein
Mol. Mass.:
125111.08
Organism:
Homo sapiens (Human)
Description:
P52333
Residue:
1124
  
Inhibitor
Name:
BDBM279813
Synonyms:
3-((1R,3s,5S)-3-((4-((5-(hydroxymethyl)-1H-pyrazol-3-yl)amino)-6-methoxypyrimidin-2-yl)(methyl)amino)-8-azabicyclo[3.2.1]octan-8-yl)-propanenitrile US10485803, Example 5 | US11110095, Example 5
Type:
Small organic molecule
Emp. Form.:
C20H28N8O2
Mol. Mass.:
412.4887
SMILES:
COc1cc(Nc2cc(CO)[nH]n2)nc(n1)N(C)[C@H]1C[C@@H]2CC[C@H](C1)N2CCC#N
: