Target
Tyrosine-protein kinase JAK1
Ligand
BDBM279814
Substrate
Meas. Tech.
Biochemical JAK and Off-Target Kinase Assays
Ki
0.55±n/a nM
Citation
 Huang, X Pyrimidine compounds as JAK kinase inhibitors US Patent  US10485803 Publication Date 11/26/2019 
Target
Name:
Tyrosine-protein kinase JAK1
Synonyms:
JAK-1 JAK1A JAK1_HUMAN Janus kinase 1 (JAK1) | Janus kinase 1 JAK1
Type:
Protein
Mol. Mass.:
133293.73
Organism:
Homo sapiens (Human)
Description:
P23458
Residue:
1154
  
Inhibitor
Name:
BDBM279814
Synonyms:
5-(((1R,3s,5S)-3-((4-((5-(hydroxymethyl)-1H-pyrazol-3-yl)amino)-6-methoxypyrimidin-2-yl)amino)-9-azabicyclo[3.3.1]nonan-9-yl)methyl)picolinonitrile US10485803, Example 6 | US11110095, Example 6
Type:
Small organic molecule
Emp. Form.:
C24H29N9O2
Mol. Mass.:
475.5462
SMILES:
COc1cc(Nc2cc(CO)[nH]n2)nc(N[C@H]2C[C@@H]3CCC[C@H](C2)N3Cc2ccc(nc2)C#N)n1
: