Target
Tyrosine-protein kinase JAK1
Ligand
BDBM279816
Substrate
Meas. Tech.
Biochemical JAK and Off-Target Kinase Assays
Ki
0.55±n/a nM
Citation
 Huang, X Pyrimidine compounds as JAK kinase inhibitors US Patent  US10485803 Publication Date 11/26/2019 
Target
Name:
Tyrosine-protein kinase JAK1
Synonyms:
JAK-1 JAK1A JAK1_HUMAN Janus kinase 1 (JAK1) | Janus kinase 1 JAK1
Type:
Protein
Mol. Mass.:
133293.73
Organism:
Homo sapiens (Human)
Description:
P23458
Residue:
1154
  
Inhibitor
Name:
BDBM279816
Synonyms:
Isobutyl (1R,3s,5S)-3-((4-((5-(hydroxymethyl)-1H-pyrazol-3-yl)amino)-6-methoxypyrimidin-2-yl)(methyl)amino)-9-azabicyclo[3.3.1]nonane-9-carboxylate US10485803, Example 8 | US11110095, Example 8
Type:
Small organic molecule
Emp. Form.:
C23H35N7O4
Mol. Mass.:
473.5685
SMILES:
COc1cc(Nc2cc(CO)[nH]n2)nc(n1)N(C)[C@H]1C[C@@H]2CCC[C@H](C1)N2C(=O)OCC(C)C
: