Target
Non-receptor tyrosine-protein kinase TYK2
Ligand
BDBM279829
Substrate
Meas. Tech.
Biochemical JAK and Off-Target Kinase Assays
Ki
0.55±n/a nM
Citation
 Huang, X Pyrimidine compounds as JAK kinase inhibitors US Patent  US10485803 Publication Date 11/26/2019 
Target
Name:
Non-receptor tyrosine-protein kinase TYK2
Synonyms:
Non-receptor tyrosine-protein kinase TYK2 (TYK2) TYK2_HUMAN | Tyrosine-protein kinase TYK2
Type:
Protein
Mol. Mass.:
133666.03
Organism:
Homo sapiens (Human)
Description:
P29597
Residue:
1187
  
Inhibitor
Name:
BDBM279829
Synonyms:
US10028960, Example 1-12 US11110095, Example 1-12
Type:
Small organic molecule
Emp. Form.:
C21H30N8O4S
Mol. Mass.:
490.579
SMILES:
COc1cc(Nc2cc(CO)[nH]n2)nc(n1)N(C)[C@H]1C[C@@H]2CCC[C@H](C1)N2S(=O)(=O)CCC#N
: