Target
Voltage-dependent T-type calcium channel subunit alpha-1H
Ligand
BDBM164208
Substrate
Meas. Tech.
High-Throughput Cav3.1 T-Type Fluorescent Assay
IC50
530±n/a nM
Citation
 PubChem, PCPajouhesh, HHolland, RZhang, LPajouhesh, HLamontagne, JWhelan, B Benzimidazole inhibitors of the sodium channel US Patent  US9688615 Publication Date 6/27/2017 
Target
Name:
Voltage-dependent T-type calcium channel subunit alpha-1H
Synonyms:
CAC1H_HUMAN Low-voltage-activated calcium channel alpha1 3.2 subunit Voltage-gated calcium channel voltage-dependent T-type calcium channel subunit alpha-1H isoform a
Type:
Enzyme Catalytic Domain
Mol. Mass.:
259187.68
Organism:
Homo sapiens (Human)
Description:
Calcium channel (Type T,L) 0 0::O95180
Residue:
2353
  
Inhibitor
Name:
BDBM164208
Synonyms:
US9688615, 19
Type:
Small organic molecule
Emp. Form.:
C19H22F6N4O
Mol. Mass.:
436.3946
SMILES:
CC(C)(C)NC(=O)CN1CC(Cc2nc3c(cc(cc3[nH]2)C(F)(F)F)C(F)(F)F)C1
: