Target
Rho-associated protein kinase 2
Ligand
BDBM296019
Substrate
Meas. Tech.
In Vitro ROCK Assays
pH
7.5±n/a
IC50
5.32±n/a nM
Comments
extracted
Citation
 Hu, ZSitkoff, DFQuan, ML Tied-back benzamide derivatives as potent rock inhibitors US Patent  US10112939 Publication Date 10/30/2018 
Target
Name:
Rho-associated protein kinase 2
Synonyms:
KIAA0619 ROCK2 Rho kinase 2 (ROCKII) Rho-associated protein kinase 2 (ROCK2) Rho-associated protein kinase 2/Transforming protein RhoA Rho-associated, coiled-coil-containing protein kinase II p164 ROCK-2
Type:
Protein
Mol. Mass.:
160885.43
Organism:
Homo sapiens (Human)
Description:
O75116
Residue:
1388
  
Inhibitor
Name:
BDBM296019
Synonyms:
3-[(2R)-4-hydroxy-1-[3- methoxy-4-(1H-pyrazol- 4-yl)benzoyl]pyrrolidin- 2-yl]-N-[(3-methyl-1,2- oxazol-5-yl)methyl] benzamide | US10112939, Example 58
Type:
Small organic molecule
Emp. Form.:
C27H27N5O5
Mol. Mass.:
501.5338
SMILES:
COc1cc(ccc1-c1cn[nH]c1)C(=O)N1CC(O)C[C@@H]1c1cccc(c1)C(=O)NCc1cc(C)no1
: