Target
Rho-associated protein kinase 2
Ligand
BDBM296030
Substrate
Meas. Tech.
In Vitro ROCK Assays
pH
7.5±n/a
IC50
1.28±n/a nM
Comments
extracted
Citation
 Hu, ZSitkoff, DFQuan, ML Tied-back benzamide derivatives as potent rock inhibitors US Patent  US10112939 Publication Date 10/30/2018 
Target
Name:
Rho-associated protein kinase 2
Synonyms:
KIAA0619 ROCK2 Rho kinase 2 (ROCKII) Rho-associated protein kinase 2 (ROCK2) Rho-associated protein kinase 2/Transforming protein RhoA Rho-associated, coiled-coil-containing protein kinase II p164 ROCK-2
Type:
Protein
Mol. Mass.:
160885.43
Organism:
Homo sapiens (Human)
Description:
O75116
Residue:
1388
  
Inhibitor
Name:
BDBM296030
Synonyms:
US10112939, Example 69 | US10112939, Example 70
Type:
Small organic molecule
Emp. Form.:
C21H22N4O2
Mol. Mass.:
362.425
SMILES:
COc1cc(ccc1-c1cn[nH]c1)C(=O)N[C@@H]1CNC[C@H]1c1ccccc1
: