Target
Rho-associated protein kinase 2
Ligand
BDBM296046
Substrate
Meas. Tech.
In Vitro ROCK Assays
pH
7.5±n/a
IC50
5.42±n/a nM
Comments
extracted
Citation
 Hu, ZSitkoff, DFQuan, ML Tied-back benzamide derivatives as potent rock inhibitors US Patent  US10112939 Publication Date 10/30/2018 
Target
Name:
Rho-associated protein kinase 2
Synonyms:
KIAA0619 ROCK2 Rho kinase 2 (ROCKII) Rho-associated protein kinase 2 (ROCK2) Rho-associated protein kinase 2/Transforming protein RhoA Rho-associated, coiled-coil-containing protein kinase II p164 ROCK-2
Type:
Protein
Mol. Mass.:
160885.43
Organism:
Homo sapiens (Human)
Description:
O75116
Residue:
1388
  
Inhibitor
Name:
BDBM296046
Synonyms:
US10112939, Example 86
Type:
Small organic molecule
Emp. Form.:
C27H30N4O4
Mol. Mass.:
474.5515
SMILES:
COC1C[C@@H](N(C1)C(=O)c1ccc(-c2cn[nH]c2)c(OC)c1)c1cccc(c1)C(=O)NCC1CC1
: