Target
Tyrosine-protein kinase JAK1 [574-1154]
Ligand
BDBM387818
Substrate
Meas. Tech.
Enzymatic Inhibition Assay
IC50
0.400±n/a nM
Citation
 Kreutter, KDLeonard, KRizzolio, MCSmith, RCTichenor, MSWang, A Small molecule inhibitors of the JAK family of kinases US Patent  US10487083 Publication Date 11/26/2019 
Target
Name:
Tyrosine-protein kinase JAK1 [574-1154]
Synonyms:
JAK1 JAK1A JAK1_HUMAN
Type:
Protein
Mol. Mass.:
66641.39
Organism:
Homo sapiens (Human)
Description:
P23458[574-1154]
Residue:
581
  
Inhibitor
Name:
BDBM387818
Synonyms:
2-(1-((1r,4r)-4-(Cyanomethyl)cyclohexyl)-1,6-dihydroimidazo[4,5-d]pyrrolo[2,3-b]pyridin-2-yl)-N-(2-hydroxy-2-methylpropyl)acetamide US10487083, Example 1 US11059823, Example 1
Type:
Small organic molecule
Emp. Form.:
C22H28N6O2
Mol. Mass.:
408.4967
SMILES:
CC(C)(O)CNC(=O)Cc1nc2cnc3[nH]ccc3c2n1[C@H]1CC[C@H](CC#N)CC1
: