Target
Tyrosine-protein kinase JAK3 [512-1124]
Ligand
BDBM387820
Substrate
Meas. Tech.
Enzymatic Inhibition Assay
IC50
82.8±n/a nM
Citation
 Kreutter, KDLeonard, KRizzolio, MCSmith, RCTichenor, MSWang, A Small molecule inhibitors of the JAK family of kinases US Patent  US10487083 Publication Date 11/26/2019 
Target
Name:
Tyrosine-protein kinase JAK3 [512-1124]
Synonyms:
JAK3 JAK3_HUMAN
Type:
Protein
Mol. Mass.:
68951.94
Organism:
Homo sapiens (Human)
Description:
P52333[512-1124]
Residue:
613
  
Inhibitor
Name:
BDBM387820
Synonyms:
2-(1-((1r,4r)-4-(Cyanomethyl)cyclohexyl)-1,6-dihydroimidazo[4,5-d]pyrrolo[2,3-b]pyridin-2-yl)-N-(cyclopropylmethyl)acetamide US10487083, Example 3 US11059823, Example 3
Type:
Small organic molecule
Emp. Form.:
C22H26N6O
Mol. Mass.:
390.4814
SMILES:
O=C(Cc1nc2cnc3[nH]ccc3c2n1[C@H]1CC[C@H](CC#N)CC1)NCC1CC1
: