Target
Tyrosine-protein kinase JAK2 [532-1132]
Ligand
BDBM387827
Substrate
Meas. Tech.
Enzymatic Inhibition Assay
IC50
6.50±n/a nM
Citation
 Kreutter, KDLeonard, KRizzolio, MCSmith, RCTichenor, MSWang, A Small molecule inhibitors of the JAK family of kinases US Patent  US10487083 Publication Date 11/26/2019 
Target
Name:
Tyrosine-protein kinase JAK2 [532-1132]
Synonyms:
JAK2 JAK2_HUMAN
Type:
Protein
Mol. Mass.:
69777.30
Organism:
Homo sapiens (Human)
Description:
O60674[532-1132]
Residue:
601
  
Inhibitor
Name:
BDBM387827
Synonyms:
N-(4-(Cyanomethyl)bicyclo[2.2.1]heptan-1-yl)-2-(1-((1r, 4r)-4-(cyanomethyl)cyclohexyl)-1,6-dihydroimidazo[4,5-d]pyrrolo[2,3-b]pyridin-2-yl)acetamide US10487083, Example 10 US11059823, Example 10
Type:
Small organic molecule
Emp. Form.:
C27H31N7O
Mol. Mass.:
469.5813
SMILES:
O=C(Cc1nc2cnc3[nH]ccc3c2n1[C@H]1CC[C@H](CC#N)CC1)NC12CCC(CC#N)(CC1)C2
: