Target
Coagulation factor XI
Ligand
BDBM142881
Substrate
Meas. Tech.
Factor XIa assay
Ki
456±n/a nM
Citation
 Corte, JRFang, TDecicco, CPPinto, DJRossi, KAHu, ZJeon, YQuan, MLSmallheer, JMWang, YYang, W Macrocycles as factor XIa inhibitors US Patent  US10487086 Publication Date 11/26/2019 
Target
Name:
Coagulation factor XI
Synonyms:
Coagulation factor XIa Coagulation factor XIa light chain FA11_HUMAN Factor XIa PTA | Plasma thromboplastin antecedent
Type:
Enzyme
Mol. Mass.:
70130.58
Organism:
Homo sapiens (Human)
Description:
P03951
Residue:
625
  
Inhibitor
Name:
BDBM142881
Synonyms:
US10487086, Example I-242 US8940720, I-242
Type:
Small organic molecule
Emp. Form.:
C31H34ClN9O5
Mol. Mass.:
648.112
SMILES:
CCOC(=O)[C@@H]1CCCC[C@H](NC(=O)\C=C\c2cc(Cl)ccc2-n2cnnn2)c2nc(c(C)[nH]2)-c2ccc(NC(=O)OC)cc2N1
: