Target
Glucagon-like peptide 1 receptor
Ligand
BDBM420031
Substrate
Meas. Tech.
GLP-1 Assay with GLP1 Endogenous Agonist
EC50
5700±n/a nM
Citation
 Lindsley, CWNiswender, K Positive allosteric modulators of the GLP-1 receptor US Patent  US10487087 Publication Date 11/26/2019 
Target
Name:
Glucagon-like peptide 1 receptor
Synonyms:
GLP-1 receptor GLP-1R GLP1R_HUMAN Glucagon-like peptide 1 receptor (GLP-1)
Type:
Enzyme
Mol. Mass.:
53035.78
Organism:
Homo sapiens (Human)
Description:
P43220
Residue:
463
  
Inhibitor
Name:
BDBM420031
Synonyms:
2-cyclopentyl-N-(((S)-1-isopropylpyrrolidin-2- yl)methyl)-10-methyl-1-oxo-1,2,3,4- tetrahydropyrazino[1,2-a]indole-4-carboxamide | US10487087, Compound 3
Type:
Small organic molecule
Emp. Form.:
C26H36N4O2
Mol. Mass.:
436.5896
SMILES:
CC(C)N1CCC[C@H]1CNC(=O)C1CN(C2CCCC2)C(=O)c2c(C)c3ccccc3n12
: