Target
Isoform 2 of MAP kinase-interacting serine/threonine-protein kinase 1 (MNK1a) 344D]
Ligand
BDBM420109
Substrate
Meas. Tech.
MKNK1 Kinase High ATP Assay
IC50
26.0±n/a nM
Citation
 Giese, AKlar, UGraham, KKettschau, GSülzle, DLienau, PPetersen, KLeFranc, JSchmidt, N Pyrazolopyridinamines as MKNK1 and MKNK2 inhibitors US Patent  US10487092 Publication Date 11/26/2019 
Target
Name:
Isoform 2 of MAP kinase-interacting serine/threonine-protein kinase 1 (MNK1a) 344D]
Synonyms:
Isoform 2 of MAP kinase-interacting serine/threonine-protein kinase 1 (MNK1a) 344D] MAP kinase signal-integrating kinase 1 (MNK1) (T344D) MAP kinase-interacting serine/threonine-protein kinase 1 (MKNK1) (T344D) MAP kinase-interacting serine/threonine-protein kinase 1 (MNK1a) [T344D] MKNK1 MKNK1_HUMAN MNK1a
Type:
Protein
Mol. Mass.:
47416.00
Organism:
Homo sapiens (Human)
Description:
Q9BUB5-2 with T344D
Residue:
424
  
Inhibitor
Name:
BDBM420109
Synonyms:
Azetidin-1-yl[(7S)-4-(pyrazolo[1,5-a]pyridin-5-ylamino)-5,6,7,8-tetrahydro[1]benzothieno[2,3-d]pyrimidin-7-yl]methanone | US10487092, Example 20
Type:
Small organic molecule
Emp. Form.:
C21H20N6OS
Mol. Mass.:
404.488
SMILES:
O=C([C@H]1CCc2c(C1)sc1ncnc(Nc3ccn4nccc4c3)c21)N1CCC1
: