Target
Isoform 2 of MAP kinase-interacting serine/threonine-protein kinase 1 (MNK1a) 344D]
Ligand
BDBM420251
Substrate
Meas. Tech.
MKNK1 Kinase High ATP Assay
IC50
1.000±n/a nM
Citation
 Giese, AKlar, UGraham, KKettschau, GSülzle, DLienau, PPetersen, KLeFranc, JSchmidt, N Pyrazolopyridinamines as MKNK1 and MKNK2 inhibitors US Patent  US10487092 Publication Date 11/26/2019 
Target
Name:
Isoform 2 of MAP kinase-interacting serine/threonine-protein kinase 1 (MNK1a) 344D]
Synonyms:
Isoform 2 of MAP kinase-interacting serine/threonine-protein kinase 1 (MNK1a) 344D] MAP kinase signal-integrating kinase 1 (MNK1) (T344D) MAP kinase-interacting serine/threonine-protein kinase 1 (MKNK1) (T344D) MAP kinase-interacting serine/threonine-protein kinase 1 (MNK1a) [T344D] MKNK1 MKNK1_HUMAN MNK1a
Type:
Protein
Mol. Mass.:
47416.00
Organism:
Homo sapiens (Human)
Description:
Q9BUB5-2 with T344D
Residue:
424
  
Inhibitor
Name:
BDBM420251
Synonyms:
(7S)—N-[3-(Dimethylamino)propyl]-4-[(6-methoxypyrazolo[1,5-a]pyridin-5-yl)amino]-N-methyl-5,6,7,8-tetrahydro[1]benzothieno[2,3-d]pyrimidine-7-carboxamide | US10487092, Example 99
Type:
Small organic molecule
Emp. Form.:
C25H31N7O2S
Mol. Mass.:
493.624
SMILES:
COc1cn2nccc2cc1Nc1ncnc2sc3C[C@H](CCc3c12)C(=O)N(C)CCCN(C)C
: