Target
Receptor-type tyrosine-protein kinase FLT3
Ligand
BDBM239033
Substrate
Meas. Tech.
Biochemical Assay for Inhibitors of FLT3 Kinase Activity
IC50
<50.0±n/a nM
Citation
 Lombardi Borgia, ACiomei, MDonati, DNesi, M Substituted indazole derivatives active as kinase inhibitiors US Patent  US10478423 Publication Date 11/19/2019 
Target
Name:
Receptor-type tyrosine-protein kinase FLT3
Synonyms:
CD135 FL cytokine receptor FLK2 FLT3 Fetal liver kinase-2 Fms-like tyrosine kinase 3 (Flt-3) STK-1 Stem cell tyrosine kinase 1
Type:
Enzyme
Mol. Mass.:
112888.62
Organism:
Homo sapiens (Human)
Description:
P36888
Residue:
993
  
Inhibitor
Name:
BDBM239033
Synonyms:
US10028934, Compound 19 US9408850, 19
Type:
Small organic molecule
Emp. Form.:
C29H33N5O3
Mol. Mass.:
499.604
SMILES:
CN1CCC(CC1)Nc1ccc(cc1)C(=O)Nc1n[nH]c2cc(OCCOCc3ccccc3)ccc12
: