Target
Mast/stem cell growth factor receptor Kit
Ligand
BDBM239035
Substrate
Meas. Tech.
Biochemical Assay for Inhibitors of KIT Kinase Activity
IC50
260±n/a nM
Citation
 Lombardi Borgia, ACiomei, MDonati, DNesi, M Substituted indazole derivatives active as kinase inhibitiors US Patent  US10478423 Publication Date 11/19/2019 
Target
Name:
Mast/stem cell growth factor receptor Kit
Synonyms:
CD117 antigen KIT Mast/stem cell growth factor receptor Kit (cKIT) Proto-oncogene tyrosine-protein kinase Kit Stem cell growth factor receptor Tyrosine-protein kinase Kit c-kit v-kit Hardy-Zuckerman 4 feline sarcoma viral oncogene homolog
Type:
Protein
Mol. Mass.:
109869.37
Organism:
Homo sapiens (Human)
Description:
P10721
Residue:
976
  
Inhibitor
Name:
BDBM239035
Synonyms:
US10028934, Compound 24 US9408850, 24
Type:
Small organic molecule
Emp. Form.:
C27H28N4O4
Mol. Mass.:
472.5356
SMILES:
O=C(Nc1n[nH]c2cc(OCCOCc3ccccc3)ccc12)c1ccc(cc1)N1CCOCC1
: