Target
Mast/stem cell growth factor receptor Kit
Ligand
BDBM239021
Substrate
Meas. Tech.
Biochemical Assay for Inhibitors of KIT Kinase Activity
IC50
613±n/a nM
Citation
 Lombardi Borgia, ACiomei, MDonati, DNesi, M Substituted indazole derivatives active as kinase inhibitiors US Patent  US10478423 Publication Date 11/19/2019 
Target
Name:
Mast/stem cell growth factor receptor Kit
Synonyms:
CD117 antigen KIT Mast/stem cell growth factor receptor Kit (cKIT) Proto-oncogene tyrosine-protein kinase Kit Stem cell growth factor receptor Tyrosine-protein kinase Kit c-kit v-kit Hardy-Zuckerman 4 feline sarcoma viral oncogene homolog
Type:
Protein
Mol. Mass.:
109869.37
Organism:
Homo sapiens (Human)
Description:
P10721
Residue:
976
  
Inhibitor
Name:
BDBM239021
Synonyms:
US10028934, Compound 38 US9408850, 38 | US9597317, 38
Type:
Small organic molecule
Emp. Form.:
C28H30FN5O3
Mol. Mass.:
503.5679
SMILES:
CN1CCN(CC1)c1ccc(C(=O)Nc2n[nH]c3cc(OCCOCc4ccccc4)ccc23)c(F)c1
: