Target
Lysine-specific demethylase 4C
Ligand
BDBM296098
Substrate
Meas. Tech.
JMJD2C Assay
Temperature
298.15±n/a K
IC50
550±n/a nM
Comments
extracted
Citation
 Boloor, AKanouni, TStafford, JAVeal, JMWallace, MB Histone demethylase inhibitors US Patent  US10112940 Publication Date 10/30/2018 
Target
Name:
Lysine-specific demethylase 4C
Synonyms:
GASC-1 protein Gene amplified in squamous cell carcinoma 1 protein JMJD2C Jumonji domain-containing protein 2C KDM4C_HUMAN | KIAA0780
Type:
Protein
Mol. Mass.:
119979.01
Organism:
Homo sapiens (Human)
Description:
Q9H3R0
Residue:
1056
  
Inhibitor
Name:
BDBM296098
Synonyms:
2-[4-(3-phenyl-piperidin-1-yl)-phenoxy]- pyrido[3,4-d]pyrimidin-4-ol US10202381, Example 25 US10611763, Example 25 US11535616, Example 25
Type:
Small organic molecule
Emp. Form.:
C24H22N4O2
Mol. Mass.:
398.4571
SMILES:
Oc1nc(Oc2ccc(cc2)N2CCCC(C2)c2ccccc2)nc2cnccc12
: