Target
Lysine-specific demethylase 4C
Ligand
BDBM296175
Substrate
Meas. Tech.
JMJD2C Assay
Temperature
298.15±n/a K
IC50
5500±n/a nM
Comments
extracted
Citation
 Boloor, AKanouni, TStafford, JAVeal, JMWallace, MB Histone demethylase inhibitors US Patent  US10112940 Publication Date 10/30/2018 
Target
Name:
Lysine-specific demethylase 4C
Synonyms:
GASC-1 protein Gene amplified in squamous cell carcinoma 1 protein JMJD2C Jumonji domain-containing protein 2C KDM4C_HUMAN | KIAA0780
Type:
Protein
Mol. Mass.:
119979.01
Organism:
Homo sapiens (Human)
Description:
Q9H3R0
Residue:
1056
  
Inhibitor
Name:
BDBM296175
Synonyms:
2-[4-[4-(3,6-dihydro-2H-pyran-4-yl)-N- methylanilino]phenoxy]pyrido[3,4- d]pyrimidin-4-ol US10202381, Example 98 US10611763, Example 98 US11535616, Example 98
Type:
Small organic molecule
Emp. Form.:
C25H22N4O3
Mol. Mass.:
426.4672
SMILES:
CN(c1ccc(Oc2nc(O)c3ccncc3n2)cc1)c1ccc(cc1)C1=CCOCC1
: