Target
Lysine-specific demethylase 4C
Ligand
BDBM296184
Substrate
Meas. Tech.
JMJD2C Assay
Temperature
298.15±n/a K
IC50
5500±n/a nM
Comments
extracted
Citation
 Boloor, AKanouni, TStafford, JAVeal, JMWallace, MB Histone demethylase inhibitors US Patent  US10112940 Publication Date 10/30/2018 
Target
Name:
Lysine-specific demethylase 4C
Synonyms:
GASC-1 protein Gene amplified in squamous cell carcinoma 1 protein JMJD2C Jumonji domain-containing protein 2C KDM4C_HUMAN | KIAA0780
Type:
Protein
Mol. Mass.:
119979.01
Organism:
Homo sapiens (Human)
Description:
Q9H3R0
Residue:
1056
  
Inhibitor
Name:
BDBM296184
Synonyms:
2-[4-[N-methyl-4-[1- (trifluoromethyl)cyclopropyl]anilino] phenoxy]pyrido[3,4-d]pyrimidin-4-ol US10202381, Example 107 US10611763, Example 107 US11535616, Example 107
Type:
Small organic molecule
Emp. Form.:
C24H19F3N4O2
Mol. Mass.:
452.4285
SMILES:
CN(c1ccc(Oc2nc(O)c3ccncc3n2)cc1)c1ccc(cc1)C1(CC1)C(F)(F)F
: