Target
Replicase polyprotein 1ab
Ligand
BDBM50360449
Substrate
Meas. Tech.
3CLpro enzyme assay
IC50
27100±n/a nM
Citation
 Zhu, WXu, MChen, CZGuo, HShen, MHu, XShinn, PKlumpp-Thomas, CMichael, SGZheng, W Identification of SARS-CoV-2 3CL Protease Inhibitors by a Quantitative High-throughput Screening. bioRxiv 0:0 (2020)  
Target
Name:
Replicase polyprotein 1ab
Synonyms:
ORF1ab polyprotein pp1ab | rep
Type:
Protein
Mol. Mass.:
794070.71
Organism:
2019-nCoV
Description:
P0DTD1
Residue:
7096
  
Inhibitor
Name:
BDBM50360449
Synonyms:
CHEMBL1215739 | MG-149
Type:
Small organic molecule
Emp. Form.:
C22H28O3
Mol. Mass.:
340.4559
SMILES:
CCCCCCCc1ccc(CCc2cccc(O)c2C(O)=O)cc1
: