Target
Toll-like receptor 7
Ligand
BDBM273952
Substrate
Meas. Tech.
Biological Assay
IC50
0.400±n/a nM
Citation
 Dyckman, AJDodd, DSMussari, CPPasunoori, LKumar, SR [1,2,4]triazolo[1,5-a]pyridinyl substituted indole compounds US Patent  US10478424 Publication Date 11/19/2019 
Target
Name:
Toll-like receptor 7
Synonyms:
ORF Names:UNQ248/PRO285 TLR7_HUMAN | Toll-like receptor 7 (TLR7)
Type:
Enzyme
Mol. Mass.:
120945.35
Organism:
Homo sapiens (Human)
Description:
Q9NYK1
Residue:
1049
  
Inhibitor
Name:
BDBM273952
Synonyms:
US10071079, Example 738 | US10478424, Example 738
Type:
Small organic molecule
Emp. Form.:
C30H37FN6O
Mol. Mass.:
516.6528
SMILES:
CC(C)c1c([nH]c2ccc(cc12)C1CCN(CC1)C(=O)CN1CC[C@H](F)C1)-c1cn2ncnc2c(C)c1C
: