Target
Serine/threonine-protein kinase ATR
Ligand
BDBM420796
Substrate
Meas. Tech.
Inhibition Assay
Ki
<10±n/a nM
Citation
 Charrier, JDurrant, SJKay, DKnegtel, RMMacCormick, SMortimore, MPO Donnell, MEPinder, JRutherford, AVirani, ANYoung, SCReaper, PM Substituted pyrazin-2-amines as inhibitors of ATR kinase US Patent  US10479784 Publication Date 11/19/2019 
Target
Name:
Serine/threonine-protein kinase ATR
Synonyms:
ATR Ataxia telangiectasia and Rad3-related protein (ATR) FRP1 | Serine-protein kinase ATR
Type:
Protein
Mol. Mass.:
301404.58
Organism:
Homo sapiens (Human)
Description:
Q13535
Residue:
2644
  
Inhibitor
Name:
BDBM420796
Synonyms:
US10479784, Compound IA-296 | US10961232, Compound IA-296
Type:
Small organic molecule
Emp. Form.:
C22H23N7O3S
Mol. Mass.:
465.528
SMILES:
CNCc1ccc(cc1)-c1nnc(o1)-c1nc(cnc1N)-c1ccc(cc1)S(=O)(=O)N(C)C
: