Target
Serine/threonine-protein kinase ATR
Ligand
BDBM420915
Substrate
Meas. Tech.
Inhibition Assay
Ki
<10±n/a nM
Citation
 Charrier, JDurrant, SJKay, DKnegtel, RMMacCormick, SMortimore, MPO Donnell, MEPinder, JRutherford, AVirani, ANYoung, SCReaper, PM Substituted pyrazin-2-amines as inhibitors of ATR kinase US Patent  US10479784 Publication Date 11/19/2019 
Target
Name:
Serine/threonine-protein kinase ATR
Synonyms:
ATR Ataxia telangiectasia and Rad3-related protein (ATR) FRP1 | Serine-protein kinase ATR
Type:
Protein
Mol. Mass.:
301404.58
Organism:
Homo sapiens (Human)
Description:
Q13535
Residue:
2644
  
Inhibitor
Name:
BDBM420915
Synonyms:
US10479784, Compound V-8 US10961232, Compound V-8
Type:
Small organic molecule
Emp. Form.:
C24H24N8O2
Mol. Mass.:
456.4998
SMILES:
Nc1ncc(nc1C(=O)Nc1n[nH]c2ccccc12)-c1ccc(cc1)C(=O)N1CCCNCC1
: