Target
Dual specificity protein kinase TTK
Ligand
BDBM241334
Substrate
Meas. Tech.
Inhibition Kinase Assay
IC50
24.0±n/a nM
Citation
 Hoelder, SBlagg, JSolanki, SWoodward, HNaud, SBavetsias, VSheldrake, PInnocenti, PCheung, KJAtrash, B Compounds that inhibit MPS1 kinase US Patent  US10479788 Publication Date 11/19/2019 
Target
Name:
Dual specificity protein kinase TTK
Synonyms:
Dual specificity protein kinase (TTK) MPS1 Monopolar Spindle 1 (MPS1) Monopolar Spindle 1 Kinase (MPS1) TTK | TTK_HUMAN
Type:
Protein
Mol. Mass.:
97086.79
Organism:
Homo sapiens (Human)
Description:
P33981
Residue:
857
  
Inhibitor
Name:
BDBM241334
Synonyms:
US10479788, Example 178 US9409907, 178
Type:
Small organic molecule
Emp. Form.:
C20H20ClN5O2
Mol. Mass.:
397.858
SMILES:
COc1cc(Cl)ccc1Nc1ncc2ccnc(N3CCC4(COC4)C3)c2n1
: