Target
Proto-oncogene tyrosine-protein kinase receptor Ret
Ligand
BDBM296817
Substrate
Meas. Tech.
RET Enzyme Assay
pH
7.4±n/a
IC50
1.000±n/a nM
Comments
extracted
Citation
 Andrews, SWAronow, SBlake, JFBrandhuber, BJCook, AHaas, JJiang, YKolakowski, GRMcFaddin, EAMcKenney, MLMcNulty, OTMetcalf, ATMoreno, DATang, TPRen, L Substituted pyrazolo[1,5-A]pyridine compounds as RET kinase inhibitors US Patent  US10112942 Publication Date 10/30/2018 
Target
Name:
Proto-oncogene tyrosine-protein kinase receptor Ret
Synonyms:
CDHF12 Cadherin family member 12 Proto-oncogene c-Ret RET51 Tyrosine-protein kinase Ret (RET)
Type:
Protein
Mol. Mass.:
124318.29
Organism:
Homo sapiens (Human)
Description:
P07949
Residue:
1114
  
Inhibitor
Name:
BDBM296817
Synonyms:
US10112942, Example 552 US10172851, Example 552 US10953005, Example 552
Type:
Small organic molecule
Emp. Form.:
C29H31N9O3
Mol. Mass.:
553.6149
SMILES:
COc1ccc(CN2C3CC2CN(C3)c2cnc(cn2)-c2cc(OC[C@H]3CNCCO3)cn3ncc(C#N)c23)cn1
: