Target
Replicase polyprotein 1ab
Ligand
BDBM420980
Substrate
Meas. Tech.
IC50 Determination
IC50
3000±300 nM
Citation
 St. John, SEMesecar, AD Broad-spectrum non-covalent coronavirus protease inhibitors US Patent  US9975885 Publication Date 5/22/2018 
Target
Name:
Replicase polyprotein 1ab
Synonyms:
ORF1ab polyprotein pp1ab | rep
Type:
Protein
Mol. Mass.:
752739.97
Organism:
HCoV-NL63
Description:
P0C6X5
Residue:
6729
  
Inhibitor
Name:
BDBM420980
Synonyms:
US9975885, Compound 37
Type:
Small organic molecule
Emp. Form.:
C31H28N6O3S
Mol. Mass.:
564.657
SMILES:
O=C(Cn1nnc2ccccc12)N(C(C(=O)NCc1ccccc1)c1ccsc1)c1ccc(NC(=O)C2CC2)cc1
: