Target
Phosphatidylinositol 4,5-bisphosphate 3-kinase catalytic subunit gamma isoform
Ligand
BDBM421034
Substrate
Meas. Tech.
Scintillation Proximity Assay
IC50
<100±n/a nM
Citation
 Buesking, AWSparks, RBCombs, APDouty, BFalahatpisheh, NShao, LShepard, SYue, EWShvartsbart, ABurns, DMLevy, D Substituted imidazo[2,1-f][1,2,4]triazines, substituted imidazo[1,2-a]pyridines and substituted imidazo[1,2-b]pyridazines as PI3K-gamma inhibitors US Patent  US10479795 Publication Date 11/19/2019 
Target
Name:
Phosphatidylinositol 4,5-bisphosphate 3-kinase catalytic subunit gamma isoform
Synonyms:
PI3-kinase p110 subunit gamma PI3Kgamma PK3CG_HUMAN Phosphatidylinositol 4,5-bisphosphate 3-kinase (PI3K) Phosphatidylinositol 4,5-bisphosphate 3-kinase catalytic subunit gamma (PI3Kgamma) Phosphatidylinositol 4,5-bisphosphate 3-kinase catalytic subunit gamma isoform (PI3K) Phosphatidylinositol-4,5-bisphosphate 3-kinase catalytic subunit gamma isoform Phosphoinositide 3-kinases gamma (PI3K gamma) p120-PI3K
Type:
Enzyme Subunit
Mol. Mass.:
126470.30
Organism:
Homo sapiens (Human)
Description:
P48736
Residue:
1102
  
Inhibitor
Name:
BDBM421034
Synonyms:
US10479795, Example 37
Type:
Small organic molecule
Emp. Form.:
C20H25N5O3S
Mol. Mass.:
415.509
SMILES:
Cc1cn2c(cnc2c(N)n1)-c1cc(ccc1C)S(=O)(=O)N[C@H]1CC[C@H](O)CC1
: