Target
Orexin receptor type 2
Ligand
BDBM386188
Substrate
Meas. Tech.
Measurement of Orexin Type 2 Receptor Agonist Activity
EC50
0.053±n/a nM
Citation
 Fujimoto, TRikimaru, KFukuda, KSugimoto, HMatsumoto, T Substituted piperidine compound and use thereof US Patent  US10508083 Publication Date 12/17/2019 
Target
Name:
Orexin receptor type 2
Synonyms:
HCRTR2 OX2R_HUMAN Orexin receptor type 2 (OR-2) Orexin receptor type 2 (OX2R) Ox-2-R | Ox2-R
Type:
Protein
Mol. Mass.:
50710.53
Organism:
Homo sapiens (Human)
Description:
O43614
Residue:
444
  
Inhibitor
Name:
BDBM386188
Synonyms:
(2R,3S)-N-ethyl-2-(((cis-4-(3- fluorophenyl)cyclohexyl)oxy)- methyl)-3- ((methylsulfonyl)amino)piperidine- 1-carboxamide US10508083, Example 148 | US11292766, Example 148
Type:
Small organic molecule
Emp. Form.:
C22H34FN3O4S
Mol. Mass.:
455.586
SMILES:
CCNC(=O)N1CCC[C@H](NS(C)(=O)=O)[C@@H]1CO[C@H]1CC[C@H](CC1)c1cccc(F)c1
: