Target
ADP-ribosylhydrolase ARH3
Ligand
BDBM421556
Substrate
Meas. Tech.
ARH3 Assay
IC50
>16700±n/a nM
Citation
 McGonagle, AEJordan, AMWaszkowycz, BHutton, CPWaddell, IDHitchin, JRSmith, KMHamilton, NM PARG inhibitory compounds US Patent  US10508086 Publication Date 12/17/2019 
Target
Name:
ADP-ribosylhydrolase ARH3
Synonyms:
ADP-ribose glycohydrolase ARH3 ADPRHL2 ADPRS_HUMAN O-acetyl-ADP-ribose deacetylase ARH3 [Protein ADP-ribosylarginine] hydrolase-like protein 2 | [Protein ADP-ribosylserine] hydrolase
Type:
Enzyme Catalytic Domain
Mol. Mass.:
38934.22
Organism:
Homo sapiens (Human)
Description:
Q9NX46
Residue:
363
  
Inhibitor
Name:
BDBM421556
Synonyms:
3-[(4-Fluorophenyl)methyl]-N-(1-methylcyclopropyl)-1-(5-methyl-1,3,4-thiadiazol-2-yl)indazole-6-sulfonamide US10995073, Example 146
Type:
Small organic molecule
Emp. Form.:
C21H20FN5O2S2
Mol. Mass.:
457.544
SMILES:
Cc1nnc(s1)-n1nc(Cc2ccc(F)cc2)c2ccc(cc12)S(=O)(=O)NC1(C)CC1
: