Target
Calcium/calmodulin-dependent protein kinase type II subunit alpha
Ligand
BDBM6860
Substrate
Autocamtide-2
Meas. Tech.
Kinase Inhibition Assay
Temperature
298.15±n/a K
IC50
12400±n/a nM
EC50
70±n/a nM
Comments
extracted
Citation
 Zhu, GConner, SEZhou, XShih, CLi, TAnderson, BDBrooks, HBCampbell, RMConsidine, EDempsey, JAFaul, MMOgg, CPatel, BSchultz, RMSpencer, CDTeicher, BWatkins, SA Synthesis, structure-activity relationship, and biological studies of indolocarbazoles as potent cyclin D1-CDK4 inhibitors. J Med Chem 46:2027-30 (2003)  
Target
Name:
Calcium/calmodulin-dependent protein kinase type II subunit alpha
Synonyms:
CaM Kinase II Camk2a calcium/calmodulin-dependent protein kinase II alpha subunit
Type:
Enzyme Mixture
Mol. Mass.:
54120.65
Organism:
Rattus norvegicus (rat)
Description:
Consists of subunits of M.W. 50,000 and 58,000-60,000 in a 3:1 ratio.
Residue:
478
  
Inhibitor
Name:
BDBM6860
Synonyms:
6-bromo-3,13,23-triazahexacyclo[14.7.0.0^{2,10}.0^{4,9}.0^{11,15}.0^{17,22}]tricosa-1(16),2(10),4(9),5,7,11(15),17(22),18,20-nonaene-12,14-dione | Indolocarbazole deriv. 4(d)
Type:
Small Organic Molecule
Emp. Form.:
C20H10BrN3O2
Mol. Mass.:
404.216
SMILES:
Brc1ccc2c(c1)[nH]c1c3[nH]c4ccccc4c3c3C(=O)NC(=O)c3c21
:
Substrate
Name:
Autocamtide-2
Synonyms:
Type:
Peptide
Mol. Mass.:
3697.73
Organism:
Description:
Residue:
36