Target
Protein arginine N-methyltransferase 5
Ligand
BDBM421947
Substrate
Meas. Tech.
Revised Biochemical Assay
IC50
16.0±n/a nM
Citation
 Bergman, YEFoitzik, RCMorrow, BJCamerino, MAWalker, SRLagiakos, HRFeutrill, JStevenson, GIStupple, PA Tetrahydroisoquinoline derived PRMT5-inhibitors US Patent  US10494376 Publication Date 12/3/2019 
Target
Name:
Protein arginine N-methyltransferase 5
Synonyms:
72 kDa ICln-binding protein HRMT1L5 IBP72 Jak-binding protein 1 PRMT5/MEP50 complex Protein arginine methyltransferase 5 (PRMT5) SKB1 homolog Shk1 kinase-binding protein 1 homolog
Type:
Enzyme
Mol. Mass.:
72679.99
Organism:
Homo sapiens (Human)
Description:
O14744
Residue:
637
  
Inhibitor
Name:
BDBM421947
Synonyms:
US10494376, Example 55
Type:
Small organic molecule
Emp. Form.:
C28H35N3O5
Mol. Mass.:
493.5946
SMILES:
CCOc1cc(ccc1C(=O)NC[C@@H](O)[C@@H]1Cc2ccccc2CN1)C(=O)N1C2CCCC1COC2
: