Target
Tumor necrosis factor
Ligand
BDBM296851
Substrate
Meas. Tech.
TNF or CD40L-Induced HEK-Blue Assay
IC50
<1000±n/a nM
Citation
 Marcin, LRWrobleski, STDhar, TM Heterocyclic compounds useful as inhibitors of TNF US Patent  US10112944 Publication Date 10/30/2018 
Target
Name:
Tumor necrosis factor
Synonyms:
Cachectin TNF-a TNFA TNFSF2 Tumor necrosis factor (TNFa) Tumor necrosis factor ligand superfamily member 2 Tumor necrosis factor, soluble form | tumor necrosis factor alpha
Type:
Enzyme
Mol. Mass.:
25645.11
Organism:
Homo sapiens (Human)
Description:
P01375
Residue:
233
  
Inhibitor
Name:
BDBM296851
Synonyms:
1-(5-Fluoro-2-methylphenyl)-8-(6-methoxypyridin-3-yl)-1,2,3,4-tetrahydroimidazo [1,2-a:5,4-b′]dipyridine | US10112944, Example 25
Type:
Small organic molecule
Emp. Form.:
C23H21FN4O
Mol. Mass.:
388.4374
SMILES:
COc1ccc(cn1)-c1ccc2nc3CCCN(c3n2c1)c1cc(F)ccc1C
: